Reaction Details
TargetMu-type opioid receptor
LigandBDBM50048107
Substrate/Competitorn/a
Meas. Tech.ChEMBL_1454642 (CHEMBL3361831)
Ki 0.560000±n/a nM
Citation Kumar, VClark, MJTraynor, JRLewis, JWHusbands, SM Pyrrolo- and pyridomorphinans: non-selective opioid antagonists and delta opioid agonists/mu opioid partial agonists. Bioorg Med Chem22:4067-72 (2014) 
 
Mu-type opioid receptor
Name:Mu-type opioid receptor
Type:G Protein-Coupled Receptor (GPCR)
Mol. Mass.:44789.51
Organism:Homo sapiens (Human)
Description:P35372
Residue:400
BDBM50048107
NameBDBM50048107
Synonyms:CHEMBL3309511
TypeSmall organic molecule
Emp. Form.C31H34N2O4
Mol. Mass.498.6127
SMILES[H][C@@]12Oc3c4c(C[C@@]5([H])N(CC6CC6)CC[C@@]14[C@@]5(O)CC1=C2N(Cc2ccccc2)C(=O)[C@H](C)C1)ccc3O