Reaction Details
TargetMu-type opioid receptor
LigandBDBM50048099
Substrate/Competitorn/a
Meas. Tech.ChEMBL_1454642 (CHEMBL3361831)
Ki 13±n/a nM
Citation Kumar, VClark, MJTraynor, JRLewis, JWHusbands, SM Pyrrolo- and pyridomorphinans: non-selective opioid antagonists and delta opioid agonists/mu opioid partial agonists. Bioorg Med Chem22:4067-72 (2014) 
 
Mu-type opioid receptor
Name:Mu-type opioid receptor
Type:G Protein-Coupled Receptor (GPCR)
Mol. Mass.:44789.51
Organism:Homo sapiens (Human)
Description:P35372
Residue:400
BDBM50048099
NameBDBM50048099
Synonyms:CHEMBL3357966
TypeSmall organic molecule
Emp. Form.C30H32N2O6
Mol. Mass.516.5849
SMILES[H][C@@]12Oc3c4c(C[C@@]5([H])N(C)CC[C@@]14[C@@]5(O)Cc1c(CC(=O)OCC)c(O)n(Cc4ccccc4)c21)ccc3O