Reaction Details
TargetNociceptin receptor
LigandBDBM50048130
Substrate/Competitorn/a
Meas. Tech.ChEMBL_1454645 (CHEMBL3361834)
Ki 880±n/a nM
Citation Kumar, VClark, MJTraynor, JRLewis, JWHusbands, SM Pyrrolo- and pyridomorphinans: non-selective opioid antagonists and delta opioid agonists/mu opioid partial agonists. Bioorg Med Chem22:4067-72 (2014) 
 
Nociceptin receptor
Name:Nociceptin receptor
Type:G Protein-Coupled Receptor (GPCR)
Mol. Mass.:40702.87
Organism:Homo sapiens (Human)
Description:P41146
Residue:370
BDBM50048130
NameBDBM50048130
Synonyms:CHEMBL3309518
TypeSmall organic molecule
Emp. Form.C30H38N2O4
Mol. Mass.490.6337
SMILES[H][C@@]12Oc3c4c(C[C@@]5([H])N(CC6CC6)CC[C@@]14[C@@]5(O)CC1=C2N(CC2CCCCC2)C(=O)CC1)ccc3O