Reaction Details
TargetMuscarinic acetylcholine receptor M1
LigandBDBM50385682
Substrate/Competitorn/a
Meas. Tech.ChEMBL_1459947 (CHEMBL3367782)
Ki 30200±n/a nM
Citation Del Bello, FBonifazi, AQuaglia, WMazzolari, ABarocelli, EBertoni, SMatucci, RNesi, MPiergentili, AVistoli, G Mode of interaction of 1,4-dioxane agonists at the M2 and M3 muscarinic receptor orthosteric sites. Bioorg Med Chem Lett24:3255-9 (2014) 
 
Muscarinic acetylcholine receptor M1
Name:Muscarinic acetylcholine receptor M1
Type:Protein
Mol. Mass.:51442.54
Organism:Homo sapiens (Human)
Description:P11229
Residue:460
BDBM50385682
NameBDBM50385682
Synonyms:CHEMBL390842
TypeSmall organic molecule
Emp. Form.C9H20NO2
Mol. Mass.174.2601
SMILESC[C@H]1COC[C@@H](C[N+](C)(C)C)O1