Reaction Details
TargetMuscarinic acetylcholine receptor M3
LigandBDBM50048352
Substrate/Competitorn/a
Meas. Tech.ChEMBL_1459949 (CHEMBL3367784)
Ki 26915±n/a nM
Citation Del Bello, FBonifazi, AQuaglia, WMazzolari, ABarocelli, EBertoni, SMatucci, RNesi, MPiergentili, AVistoli, G Mode of interaction of 1,4-dioxane agonists at the M2 and M3 muscarinic receptor orthosteric sites. Bioorg Med Chem Lett24:3255-9 (2014) 
 
Muscarinic acetylcholine receptor M3
Name:Muscarinic acetylcholine receptor M3
Type:Enzyme
Mol. Mass.:66151.03
Organism:Homo sapiens (Human)
Description:P20309
Residue:590
BDBM50048352
NameBDBM50048352
Synonyms:CHEMBL3309718
TypeSmall organic molecule
Emp. Form.C8H18INO2
Mol. Mass.287.1385
SMILES[I-].C[N+](C)(C)C[C@@H]1COCCO1