Reaction Details
TargetHeat shock protein HSP 90-beta
LigandBDBM50048362
Substrate/Competitorn/a
Meas. Tech.ChEMBL_1446734 (CHEMBL3381049)
Ki 81±n/a nM
Citation Casale, EAmboldi, NBrasca, MGCaronni, DColombo, NDalvit, CFelder, ERFogliatto, GGalvani, AIsacchi, APolucci, PRiceputi, LSola, FVisco, CZuccotto, FCasuscelli, F Fragment-based hit discovery and structure-based optimization of aminotriazoloquinazolines as novel Hsp90 inhibitors. Bioorg Med Chem22:4135-50 (2014) 
 
Heat shock protein HSP 90-beta
Name:Heat shock protein HSP 90-beta
Type:Molecular Chaperone
Mol. Mass.:83229.45
Organism:Homo sapiens (Human)
Description:P08238
Residue:724
BDBM50048362
NameBDBM50048362
Synonyms:CHEMBL3309995
TypeSmall organic molecule
Emp. Form.C17H14N6O2
Mol. Mass.334.3321
SMILESNc1nc2c3ccc(N)cc3nc(Cc3ccc4OCOc4c3)n2n1