Reaction Details
TargetHeat shock protein HSP 90-beta
LigandBDBM50048374
Substrate/Competitorn/a
Meas. Tech.ChEMBL_1446734 (CHEMBL3381049)
Ki 9.0±n/a nM
Citation Casale, EAmboldi, NBrasca, MGCaronni, DColombo, NDalvit, CFelder, ERFogliatto, GGalvani, AIsacchi, APolucci, PRiceputi, LSola, FVisco, CZuccotto, FCasuscelli, F Fragment-based hit discovery and structure-based optimization of aminotriazoloquinazolines as novel Hsp90 inhibitors. Bioorg Med Chem22:4135-50 (2014) 
 
Heat shock protein HSP 90-beta
Name:Heat shock protein HSP 90-beta
Type:Molecular Chaperone
Mol. Mass.:83229.45
Organism:Homo sapiens (Human)
Description:P08238
Residue:724
BDBM50048374
NameBDBM50048374
Synonyms:CHEMBL3310151
TypeSmall organic molecule
Emp. Form.C22H22FN7O2
Mol. Mass.435.4542
SMILESCN1CCN(CC1)c1cc(F)c2c3nc(N)nn3c(Cc3ccc4OCOc4c3)nc2c1