Reaction Details
TargetHeat shock protein HSP 90-beta
LigandBDBM50048377
Substrate/Competitorn/a
Meas. Tech.ChEMBL_1446734 (CHEMBL3381049)
Ki>5000±n/a nM
Citation Casale, EAmboldi, NBrasca, MGCaronni, DColombo, NDalvit, CFelder, ERFogliatto, GGalvani, AIsacchi, APolucci, PRiceputi, LSola, FVisco, CZuccotto, FCasuscelli, F Fragment-based hit discovery and structure-based optimization of aminotriazoloquinazolines as novel Hsp90 inhibitors. Bioorg Med Chem22:4135-50 (2014) 
 
Heat shock protein HSP 90-beta
Name:Heat shock protein HSP 90-beta
Type:Molecular Chaperone
Mol. Mass.:83229.45
Organism:Homo sapiens (Human)
Description:P08238
Residue:724
BDBM50048377
NameBDBM50048377
Synonyms:CHEMBL3310154
TypeSmall organic molecule
Emp. Form.C20H19FN6O3
Mol. Mass.410.4017
SMILESCOCCNc1cc(F)cc2nc(Cc3ccc4OCOc4c3)n3nc(N)nc3c12