Reaction Details
TargetTyrosine-protein kinase JAK3
LigandBDBM50048374
Substrate/Competitorn/a
Meas. Tech.ChEMBL_1446767 (CHEMBL3381082)
IC50>10000±n/a nM
Citation Casale, EAmboldi, NBrasca, MGCaronni, DColombo, NDalvit, CFelder, ERFogliatto, GGalvani, AIsacchi, APolucci, PRiceputi, LSola, FVisco, CZuccotto, FCasuscelli, F Fragment-based hit discovery and structure-based optimization of aminotriazoloquinazolines as novel Hsp90 inhibitors. Bioorg Med Chem22:4135-50 (2014) 
 
Tyrosine-protein kinase JAK3
Name:Tyrosine-protein kinase JAK3
Type:Protein
Mol. Mass.:125111.08
Organism:Homo sapiens (Human)
Description:P52333
Residue:1124
BDBM50048374
NameBDBM50048374
Synonyms:CHEMBL3310151
TypeSmall organic molecule
Emp. Form.C22H22FN7O2
Mol. Mass.435.4542
SMILESCN1CCN(CC1)c1cc(F)c2c3nc(N)nn3c(Cc3ccc4OCOc4c3)nc2c1