Reaction Details
Target40S ribosomal protein S27
LigandBDBM50048374
Substrate/Competitorn/a
Meas. Tech.ChEMBL_1446775 (CHEMBL3381090)
IC50>10000±n/a nM
Citation Casale, EAmboldi, NBrasca, MGCaronni, DColombo, NDalvit, CFelder, ERFogliatto, GGalvani, AIsacchi, APolucci, PRiceputi, LSola, FVisco, CZuccotto, FCasuscelli, F Fragment-based hit discovery and structure-based optimization of aminotriazoloquinazolines as novel Hsp90 inhibitors. Bioorg Med Chem22:4135-50 (2014) 
 
40S ribosomal protein S27
Name:40S ribosomal protein S27
Type:PROTEIN
Mol. Mass.:9472.13
Organism:Homo sapiens (Human)
Description:ChEMBL_1446775
Residue:84
BDBM50048374
NameBDBM50048374
Synonyms:CHEMBL3310151
TypeSmall organic molecule
Emp. Form.C22H22FN7O2
Mol. Mass.435.4542
SMILESCN1CCN(CC1)c1cc(F)c2c3nc(N)nn3c(Cc3ccc4OCOc4c3)nc2c1