Reaction Details
TargetSerine/threonine-protein kinase 26
LigandBDBM50048365
Substrate/Competitorn/a
Meas. Tech.ChEMBL_1446776 (CHEMBL3381091)
IC50>10000±n/a nM
Citation Casale, EAmboldi, NBrasca, MGCaronni, DColombo, NDalvit, CFelder, ERFogliatto, GGalvani, AIsacchi, APolucci, PRiceputi, LSola, FVisco, CZuccotto, FCasuscelli, F Fragment-based hit discovery and structure-based optimization of aminotriazoloquinazolines as novel Hsp90 inhibitors. Bioorg Med Chem22:4135-50 (2014) 
 
Serine/threonine-protein kinase 26
Name:Serine/threonine-protein kinase 26
Type:PROTEIN
Mol. Mass.:46517.68
Organism:Homo sapiens (Human)
Description:ChEMBL_1510631
Residue:416
BDBM50048365
NameBDBM50048365
Synonyms:CHEMBL3309998
TypeSmall organic molecule
Emp. Form.C19H18N6O3
Mol. Mass.378.3846
SMILESNc1nc2c3ccc(NCCO)cc3nc(Cc3ccc4OCOc4c3)n2n1