Reaction Details
TargetHeat shock protein HSP 90-beta
LigandBDBM50048383
Substrate/Competitorn/a
Meas. Tech.ChEMBL_1446728 (CHEMBL3381043)
Ki 23400±n/a nM
Citation Casale, EAmboldi, NBrasca, MGCaronni, DColombo, NDalvit, CFelder, ERFogliatto, GGalvani, AIsacchi, APolucci, PRiceputi, LSola, FVisco, CZuccotto, FCasuscelli, F Fragment-based hit discovery and structure-based optimization of aminotriazoloquinazolines as novel Hsp90 inhibitors. Bioorg Med Chem22:4135-50 (2014) 
 
Heat shock protein HSP 90-beta
Name:Heat shock protein HSP 90-beta
Type:Molecular Chaperone
Mol. Mass.:83229.45
Organism:Homo sapiens (Human)
Description:P08238
Residue:724
BDBM50048383
NameBDBM50048383
Synonyms:CHEMBL3309723
TypeSmall organic molecule
Emp. Form.C12H12ClN5
Mol. Mass.261.71
SMILESCCCc1nc2c(Cl)cccc2c2nc(N)nn12