Reaction Details
TargetSerine/threonine-protein kinase tousled-like 2
LigandBDBM50048364
Substrate/Competitorn/a
Meas. Tech.ChEMBL_1446792 (CHEMBL3371266)
IC50>10000±n/a nM
Citation Casale, EAmboldi, NBrasca, MGCaronni, DColombo, NDalvit, CFelder, ERFogliatto, GGalvani, AIsacchi, APolucci, PRiceputi, LSola, FVisco, CZuccotto, FCasuscelli, F Fragment-based hit discovery and structure-based optimization of aminotriazoloquinazolines as novel Hsp90 inhibitors. Bioorg Med Chem22:4135-50 (2014) 
 
Serine/threonine-protein kinase tousled-like 2
Name:Serine/threonine-protein kinase tousled-like 2
Type:PROTEIN
Mol. Mass.:87680.67
Organism:Homo sapiens (Human)
Description:ChEMBL_1510767
Residue:772
BDBM50048364
NameBDBM50048364
Synonyms:CHEMBL3309997
TypeSmall organic molecule
Emp. Form.C19H17N5O3
Mol. Mass.363.37
SMILESOCCCNc1ccc2c3ncnn3c(nc2c1)-c1ccc2OCOc2c1