Reaction Details
TargetNon-receptor tyrosine-protein kinase TYK2
LigandBDBM50048357
Substrate/Competitorn/a
Meas. Tech.ChEMBL_1447670 (CHEMBL3375006)
IC50>10000±n/a nM
Citation Casale, EAmboldi, NBrasca, MGCaronni, DColombo, NDalvit, CFelder, ERFogliatto, GGalvani, AIsacchi, APolucci, PRiceputi, LSola, FVisco, CZuccotto, FCasuscelli, F Fragment-based hit discovery and structure-based optimization of aminotriazoloquinazolines as novel Hsp90 inhibitors. Bioorg Med Chem22:4135-50 (2014) 
 
Non-receptor tyrosine-protein kinase TYK2
Name:Non-receptor tyrosine-protein kinase TYK2
Type:Protein
Mol. Mass.:133666.03
Organism:Homo sapiens (Human)
Description:P29597
Residue:1187
BDBM50048357
NameBDBM50048357
Synonyms:CHEMBL3309990
TypeSmall organic molecule
Emp. Form.C17H12FN5O2
Mol. Mass.337.3079
SMILESNc1nc2c3c(F)cccc3nc(Cc3ccc4OCOc4c3)n2n1