Reaction Details
TargetCannabinoid receptor 2
LigandBDBM50048483
Substrate/Competitorn/a
Meas. Tech.ChEMBL_1447731 (CHEMBL3376223)
EC50 19498±n/a nM
Citation Nimczick, MPemp, DDarras, FHChen, XHeilmann, JDecker, M Synthesis and biological evaluation of bivalent cannabinoid receptor ligands based on hCB2R selective benzimidazoles reveal unexpected intrinsic properties. Bioorg Med Chem22:3938-46 (2014) 
 
Cannabinoid receptor 2
Name:Cannabinoid receptor 2
Type:G Protein-Coupled Receptor (GPCR)
Mol. Mass.:39690.94
Organism:Homo sapiens (Human)
Description:P34972
Residue:360
BDBM50048483
NameBDBM50048483
Synonyms:CHEMBL3310164
TypeSmall organic molecule
Emp. Form.C34H52N4O2
Mol. Mass.548.8023
SMILESCCOc1ccc(Cc2nc3cc(ccc3n2CCC(C)C)C(=O)NCCCCCCCCCCN(C)C)cc1