Reaction Details
TargetCannabinoid receptor 2
LigandBDBM50048489
Substrate/Competitorn/a
Meas. Tech.ChEMBL_1448521 (CHEMBL3379273)
EC50 12589±n/a nM
Citation Nimczick, MPemp, DDarras, FHChen, XHeilmann, JDecker, M Synthesis and biological evaluation of bivalent cannabinoid receptor ligands based on hCB2R selective benzimidazoles reveal unexpected intrinsic properties. Bioorg Med Chem22:3938-46 (2014) 
 
Cannabinoid receptor 2
Name:Cannabinoid receptor 2
Type:G Protein-Coupled Receptor (GPCR)
Mol. Mass.:39690.94
Organism:Homo sapiens (Human)
Description:P34972
Residue:360
BDBM50048489
NameBDBM50048489
Synonyms:CHEMBL3310160
TypeSmall organic molecule
Emp. Form.C26H36N4O2
Mol. Mass.436.5896
SMILESCCOc1ccc(Cc2nc3cc(ccc3n2CCCN(C)C)C(=O)N(CC)CC)cc1