Reaction Details
TargetCannabinoid receptor 1
LigandBDBM50048481
Substrate/Competitorn/a
Meas. Tech.ChEMBL_1448524 (CHEMBL3379276)
EC50 34674±n/a nM
Citation Nimczick, MPemp, DDarras, FHChen, XHeilmann, JDecker, M Synthesis and biological evaluation of bivalent cannabinoid receptor ligands based on hCB2R selective benzimidazoles reveal unexpected intrinsic properties. Bioorg Med Chem22:3938-46 (2014) 
 
Cannabinoid receptor 1
Name:Cannabinoid receptor 1
Type:G Protein-Coupled Receptor (GPCR)
Mol. Mass.:52868.96
Organism:Homo sapiens (Human)
Description:P21554
Residue:472
BDBM50048481
NameBDBM50048481
Synonyms:CHEMBL3310162
TypeSmall organic molecule
Emp. Form.C49H63N7O4
Mol. Mass.814.069
SMILESCCOc1ccc(Cc2nc3cc(ccc3n2CCCN(C)CCCn2c(Cc3ccc(OCC)cc3)nc3cc(ccc23)C(=O)N(CC)CC)C(=O)N(CC)CC)cc1