Reaction Details
TargetHistone deacetylase 6
LigandBDBM50048862
Substrate/Competitorn/a
Meas. Tech.ChEMBL_1452942 (CHEMBL3366594)
IC50>100000±n/a nM
Citation Hoque, MAIslam, MNIslam, MSKato, TNishino, NIto, AYoshida, M Design and synthesis of CHAP31, trapoxin B and HC-toxin based bicyclic tetrapeptides disulfide as potent histone deacetylase inhibitors. Bioorg Med Chem22:3850-5 (2014) 
 
Histone deacetylase 6
Name:Histone deacetylase 6
Type:PROTEIN
Mol. Mass.:125762.28
Organism:Mus musculus
Description:ChEMBL_1460074
Residue:1149
BDBM50048862
NameBDBM50048862
Synonyms:CHEMBL3310510
TypeSmall organic molecule
Emp. Form.C24H40N4O4S2
Mol. Mass.512.729
SMILES[H][C@]12CCCN1C(=O)[C@@H](NC(=O)[C@]1([H])CCCCCSSCCCCC[C@]([H])(NC2=O)C(=O)N1)C(C)C