Reaction Details
TargetHistone deacetylase 1
LigandBDBM50048862
Substrate/Competitorn/a
Meas. Tech.ChEMBL_1452945 (CHEMBL3366597)
IC50 14±n/a nM
Citation Hoque, MAIslam, MNIslam, MSKato, TNishino, NIto, AYoshida, M Design and synthesis of CHAP31, trapoxin B and HC-toxin based bicyclic tetrapeptides disulfide as potent histone deacetylase inhibitors. Bioorg Med Chem22:3850-5 (2014) 
 
Histone deacetylase 1
Name:Histone deacetylase 1
Type:Enzyme
Mol. Mass.:55090.27
Organism:Homo sapiens (Human)
Description:Q13547
Residue:482
BDBM50048862
NameBDBM50048862
Synonyms:CHEMBL3310510
TypeSmall organic molecule
Emp. Form.C24H40N4O4S2
Mol. Mass.512.729
SMILES[H][C@]12CCCN1C(=O)[C@@H](NC(=O)[C@]1([H])CCCCCSSCCCCC[C@]([H])(NC2=O)C(=O)N1)C(C)C