Reaction Details
TargetProtein kinase C beta type
LigandBDBM50049437
Substrate/Competitorn/a
Meas. Tech.ChEMBL_1454734 (CHEMBL3362926)
IC50 1500±n/a nM
Citation George, DMBreinlinger, ECFriedman, MZhang, YWang, JArgiriadi, MBansal-Pakala, PBarth, MDuignan, DBHonore, PLang, QMittelstadt, SPotin, DRundell, LEdmunds, JJ Discovery of selective and orally bioavailable protein kinase C¿ (PKC¿) inhibitors from a fragment hit. J Med Chem58:222-36 (2015) 
 
Protein kinase C beta type
Name:Protein kinase C beta type
Type:Enzyme
Mol. Mass.:76873.67
Organism:Homo sapiens (Human)
Description:The recombinant human PKC enzymes were produced using a baculovirus expression system in SF9 cells
Residue:671
BDBM50049437
NameBDBM50049437
Synonyms:CHEMBL3356474
TypeSmall organic molecule
Emp. Form.C15H16F3N5O2
Mol. Mass.355.315
SMILESC[C@H]1N2C(COc3cc(c(NC4CNC4)cc23)C(F)(F)F)=NNC1=O