Reaction Details
TargetProtein kinase C alpha type
LigandBDBM50049430
Substrate/Competitorn/a
Meas. Tech.ChEMBL_1454726 (CHEMBL3362645)
IC50 4100±n/a nM
Citation George, DMBreinlinger, ECFriedman, MZhang, YWang, JArgiriadi, MBansal-Pakala, PBarth, MDuignan, DBHonore, PLang, QMittelstadt, SPotin, DRundell, LEdmunds, JJ Discovery of selective and orally bioavailable protein kinase C¿ (PKC¿) inhibitors from a fragment hit. J Med Chem58:222-36 (2015) 
 
Protein kinase C alpha type
Name:Protein kinase C alpha type
Type:Enzyme
Mol. Mass.:76755.65
Organism:Homo sapiens (Human)
Description:The recombinant human PKC enzymes were produced using a baculovirus expression system in SF9 cells
Residue:672
BDBM50049430
NameBDBM50049430
Synonyms:CHEMBL3356464
TypeSmall organic molecule
Emp. Form.C15H19N5O2
Mol. Mass.301.3437
SMILESCC1N2C(COc3cc(C)c(NC4CNC4)cc23)=NNC1=O