Reaction Details
TargetProtein kinase C alpha type
LigandBDBM50049442
Substrate/Competitorn/a
Meas. Tech.ChEMBL_1454726 (CHEMBL3362645)
IC50 1600±n/a nM
Citation George, DMBreinlinger, ECFriedman, MZhang, YWang, JArgiriadi, MBansal-Pakala, PBarth, MDuignan, DBHonore, PLang, QMittelstadt, SPotin, DRundell, LEdmunds, JJ Discovery of selective and orally bioavailable protein kinase C¿ (PKC¿) inhibitors from a fragment hit. J Med Chem58:222-36 (2015) 
 
Protein kinase C alpha type
Name:Protein kinase C alpha type
Type:Enzyme
Mol. Mass.:76755.65
Organism:Homo sapiens (Human)
Description:The recombinant human PKC enzymes were produced using a baculovirus expression system in SF9 cells
Residue:672
BDBM50049442
NameBDBM50049442
Synonyms:CHEMBL3356469
TypeSmall organic molecule
Emp. Form.C16H17F3N4O2
Mol. Mass.354.327
SMILESCC1N2C(COc3cc(c(CC4CNC4)cc23)C(F)(F)F)=NNC1=O