Reaction Details
TargetProtein kinase C theta type
LigandBDBM50049447
Substrate/Competitorn/a
Meas. Tech.ChEMBL_1454725 (CHEMBL3362644)
IC50>50000±n/a nM
Citation George, DMBreinlinger, ECFriedman, MZhang, YWang, JArgiriadi, MBansal-Pakala, PBarth, MDuignan, DBHonore, PLang, QMittelstadt, SPotin, DRundell, LEdmunds, JJ Discovery of selective and orally bioavailable protein kinase C¿ (PKC¿) inhibitors from a fragment hit. J Med Chem58:222-36 (2015) 
 
Protein kinase C theta type
Name:Protein kinase C theta type
Type:Serine/threonine-protein kinase
Mol. Mass.:81878.04
Organism:Homo sapiens (Human)
Description:Full-length human PKC theta (Panvera Catalog No. P2996).
Residue:706
BDBM50049447
NameBDBM50049447
Synonyms:CHEMBL3356460
TypeSmall organic molecule
Emp. Form.C17H21N5O3
Mol. Mass.343.3803
SMILESO=C(CC1CCNCC1)Nc1ccc2OCC3=NNC(=O)CN3c2c1