Reaction Details
TargetProtein kinase C gamma type
LigandBDBM50049441
Substrate/Competitorn/a
Meas. Tech.ChEMBL_1455517 (CHEMBL3364570)
IC50 23000±n/a nM
Citation George, DMBreinlinger, ECFriedman, MZhang, YWang, JArgiriadi, MBansal-Pakala, PBarth, MDuignan, DBHonore, PLang, QMittelstadt, SPotin, DRundell, LEdmunds, JJ Discovery of selective and orally bioavailable protein kinase C¿ (PKC¿) inhibitors from a fragment hit. J Med Chem58:222-36 (2015) 
 
Protein kinase C gamma type
Name:Protein kinase C gamma type
Type:Enzyme
Mol. Mass.:78458.05
Organism:Homo sapiens (Human)
Description:The recombinant human PKC enzymes were produced using a baculovirus expression system in SF9 cells
Residue:697
BDBM50049441
NameBDBM50049441
Synonyms:CHEMBL3356470
TypeSmall organic molecule
Emp. Form.C15H19N5O2
Mol. Mass.301.3437
SMILESC[C@H]1N2C(COc3cc(C)c(NC4CNC4)cc23)=NNC1=O