Reaction Details
TargetNeuronal acetylcholine receptor subunit alpha-7
LigandBDBM50300802
Substrate/Competitorn/a
Meas. Tech.ChEMBL_1459227 (CHEMBL3367253)
Ki 670±n/a nM
Citation Beinat, CReekie, THibbs, DXie, TOlson, TTXiao, YHarvey, AO'Connor, SColes, CTsanaktsidis, JKassiou, M Investigations of amide bond variation and biaryl modification in analogues ofa7 nAChR agonist SEN12333. Eur J Med Chem84:200-5 (2014) 
 
Neuronal acetylcholine receptor subunit alpha-7
Name:Neuronal acetylcholine receptor subunit alpha-7
Type:Enzyme
Mol. Mass.:56502.44
Organism:Rattus norvegicus (Rat)
Description:Q05941
Residue:502
BDBM50300802
NameBDBM50300802
Synonyms:5-Morpholin-4-ylpentanoic acid(4-pyridin-3-ylphenyl)amide hydrochloride CHEMBL565540
TypeSmall organic molecule
Emp. Form.C20H25N3O2
Mol. Mass.339.4314
SMILESO=C(CCCCN1CCOCC1)Nc1ccc(cc1)-c1cccnc1