Reaction Details
TargetCarbonic anhydrase 1
LigandBDBM50050846
Substrate/Competitorn/a
Meas. Tech.ChEMBL_1459252 (CHEMBL3367482)
Ki 2900±n/a nM
Citation De Monte, CCarradori, SSecci, DD'Ascenzio, MVullo, DCeruso, MSupuran, CT Cyclic tertiary sulfamates: selective inhibition of the tumor-associated carbonic anhydrases IX and XII by N- and O-substituted acesulfame derivatives. Eur J Med Chem84:240-6 (2014) 
 
Carbonic anhydrase 1
Name:Carbonic anhydrase 1
Type:Enzyme
Mol. Mass.:28873.37
Organism:Homo sapiens (Human)
Description:P00915
Residue:261
BDBM50050846
NameBDBM50050846
Synonyms:CHEMBL3322439
TypeSmall organic molecule
Emp. Form.C6H6N2O4S
Mol. Mass.202.188
SMILESCC1=CC(OCC#N)=NS(=O)(=O)O1