Reaction Details
TargetCarbonic anhydrase 2
LigandBDBM50050782
Substrate/Competitorn/a
Meas. Tech.ChEMBL_1459253 (CHEMBL3367483)
Ki>20000±n/a nM
Citation De Monte, CCarradori, SSecci, DD'Ascenzio, MVullo, DCeruso, MSupuran, CT Cyclic tertiary sulfamates: selective inhibition of the tumor-associated carbonic anhydrases IX and XII by N- and O-substituted acesulfame derivatives. Eur J Med Chem84:240-6 (2014) 
 
Carbonic anhydrase 2
Name:Carbonic anhydrase 2
Type:Enzyme
Mol. Mass.:29250.71
Organism:Homo sapiens (Human)
Description:P00918
Residue:260
BDBM50050782
NameBDBM50050782
Synonyms:CHEMBL3322453
TypeSmall organic molecule
Emp. Form.C11H9F2NO4S
Mol. Mass.289.255
SMILESCC1=CC(=O)N(Cc2c(F)cccc2F)S(=O)(=O)O1