Reaction Details
TargetCarbonic anhydrase 9
LigandBDBM50050781
Substrate/Competitorn/a
Meas. Tech.ChEMBL_1459254 (CHEMBL3367484)
Ki 309±n/a nM
Citation De Monte, CCarradori, SSecci, DD'Ascenzio, MVullo, DCeruso, MSupuran, CT Cyclic tertiary sulfamates: selective inhibition of the tumor-associated carbonic anhydrases IX and XII by N- and O-substituted acesulfame derivatives. Eur J Med Chem84:240-6 (2014) 
 
Carbonic anhydrase 9
Name:Carbonic anhydrase 9
Type:Enzyme
Mol. Mass.:49669.03
Organism:Homo sapiens (Human)
Description:Catalytic domain of human cloned isozyme was used in the assay
Residue:459
BDBM50050781
NameBDBM50050781
Synonyms:CHEMBL3322522
TypeSmall organic molecule
Emp. Form.C12H10N2O4S
Mol. Mass.278.284
SMILESCC1=CC(=O)N(Cc2ccc(cc2)C#N)S(=O)(=O)O1