Reaction Details
TargetCarbonic anhydrase 12
LigandBDBM50050774
Substrate/Competitorn/a
Meas. Tech.ChEMBL_1459255 (CHEMBL3367485)
Ki 103±n/a nM
Citation De Monte, CCarradori, SSecci, DD'Ascenzio, MVullo, DCeruso, MSupuran, CT Cyclic tertiary sulfamates: selective inhibition of the tumor-associated carbonic anhydrases IX and XII by N- and O-substituted acesulfame derivatives. Eur J Med Chem84:240-6 (2014) 
 
Carbonic anhydrase 12
Name:Carbonic anhydrase 12
Type:Enzyme
Mol. Mass.:39456.00
Organism:Homo sapiens (Human)
Description:Catalytic domain of human cloned isozyme was used in the assay
Residue:354
BDBM50050774
NameBDBM50050774
Synonyms:CHEMBL3321764
TypeSmall organic molecule
Emp. Form.C7H9NO4S
Mol. Mass.203.216
SMILESCC1=CC(=O)N(CC=C)S(=O)(=O)O1