Reaction Details
TargetCarbonic anhydrase 12
LigandBDBM50050783
Substrate/Competitorn/a
Meas. Tech.ChEMBL_1459255 (CHEMBL3367485)
Ki 92±n/a nM
Citation De Monte, CCarradori, SSecci, DD'Ascenzio, MVullo, DCeruso, MSupuran, CT Cyclic tertiary sulfamates: selective inhibition of the tumor-associated carbonic anhydrases IX and XII by N- and O-substituted acesulfame derivatives. Eur J Med Chem84:240-6 (2014) 
 
Carbonic anhydrase 12
Name:Carbonic anhydrase 12
Type:Enzyme
Mol. Mass.:39456.00
Organism:Homo sapiens (Human)
Description:Catalytic domain of human cloned isozyme was used in the assay
Residue:354
BDBM50050783
NameBDBM50050783
Synonyms:CHEMBL3322452
TypeSmall organic molecule
Emp. Form.C11H10FNO4S
Mol. Mass.271.265
SMILESCC1=CC(OCc2cccc(F)c2)=NS(=O)(=O)O1