Reaction Details
TargetCarbonic anhydrase 12
LigandBDBM50050779
Substrate/Competitorn/a
Meas. Tech.ChEMBL_1459255 (CHEMBL3367485)
Ki 126±n/a nM
Citation De Monte, CCarradori, SSecci, DD'Ascenzio, MVullo, DCeruso, MSupuran, CT Cyclic tertiary sulfamates: selective inhibition of the tumor-associated carbonic anhydrases IX and XII by N- and O-substituted acesulfame derivatives. Eur J Med Chem84:240-6 (2014) 
 
Carbonic anhydrase 12
Name:Carbonic anhydrase 12
Type:Enzyme
Mol. Mass.:39456.00
Organism:Homo sapiens (Human)
Description:Catalytic domain of human cloned isozyme was used in the assay
Residue:354
BDBM50050779
NameBDBM50050779
Synonyms:CHEMBL3322524
TypeSmall organic molecule
Emp. Form.C12H11NO5S
Mol. Mass.281.284
SMILESCC1=CC(OCC(=O)c2ccccc2)=NS(=O)(=O)O1