Reaction Details
TargetAdenosylhomocysteinase
LigandBDBM50050865
Substrate/Competitorn/a
Meas. Tech.ChEMBL_1459288 (CHEMBL3367518)
IC50 110±n/a nM
Citation Nakao, ASuzuki, HUeno, HIwasaki, HSetsuta, T Discovery of S-adenosyl-L-homocysteine hydrolase inhibitors based on non-adenosine analogs. Bioorg Med Chem Lett24:4336-40 (2014) 
 
Adenosylhomocysteinase
Name:Adenosylhomocysteinase
Type:PROTEIN
Mol. Mass.:47714.06
Organism:Homo sapiens (Human)
Description:ChEMBL_1507791
Residue:432
BDBM50050865
NameBDBM50050865
Synonyms:CHEMBL3322559
TypeSmall organic molecule
Emp. Form.C31H34Cl2N4O3
Mol. Mass.581.533
SMILESCN(C1Cc2ccccc2C1)C(=O)CN(CC(=O)NC[C@@H]1CCCN1)c1cc(Cl)ccc1Oc1ccc(Cl)cc1