Reaction Details
TargetAdenosylhomocysteinase
LigandBDBM50050872
Substrate/Competitorn/a
Meas. Tech.ChEMBL_1459288 (CHEMBL3367518)
IC50 320±n/a nM
Citation Nakao, ASuzuki, HUeno, HIwasaki, HSetsuta, T Discovery of S-adenosyl-L-homocysteine hydrolase inhibitors based on non-adenosine analogs. Bioorg Med Chem Lett24:4336-40 (2014) 
 
Adenosylhomocysteinase
Name:Adenosylhomocysteinase
Type:PROTEIN
Mol. Mass.:47714.06
Organism:Homo sapiens (Human)
Description:ChEMBL_1507791
Residue:432
BDBM50050872
NameBDBM50050872
Synonyms:CHEMBL3322552
TypeSmall organic molecule
Emp. Form.C33H38Cl2N4O3
Mol. Mass.609.586
SMILESCN(C1Cc2ccccc2C1)C(=O)CN(CC(=O)NCCN1CCCCC1)c1cc(Cl)ccc1Oc1ccc(Cl)cc1