Reaction Details
TargetAdenosylhomocysteinase
LigandBDBM50050874
Substrate/Competitorn/a
Meas. Tech.ChEMBL_1459288 (CHEMBL3367518)
IC50 44±n/a nM
Citation Nakao, ASuzuki, HUeno, HIwasaki, HSetsuta, T Discovery of S-adenosyl-L-homocysteine hydrolase inhibitors based on non-adenosine analogs. Bioorg Med Chem Lett24:4336-40 (2014) 
 
Adenosylhomocysteinase
Name:Adenosylhomocysteinase
Type:PROTEIN
Mol. Mass.:47714.06
Organism:Homo sapiens (Human)
Description:ChEMBL_1507791
Residue:432
BDBM50050874
NameBDBM50050874
Synonyms:CHEMBL3322550
TypeSmall organic molecule
Emp. Form.C29H38Cl2N6O5
Mol. Mass.621.555
SMILESCOC(=O)N1CCN(CC1)N(C)C(=O)CN(CC(=O)NCCN1CCCC1)c1cc(Cl)ccc1Oc1ccc(Cl)cc1