Reaction Details
TargetAdenosylhomocysteinase
LigandBDBM50050892
Substrate/Competitorn/a
Meas. Tech.ChEMBL_1459288 (CHEMBL3367518)
IC50 380±n/a nM
Citation Nakao, ASuzuki, HUeno, HIwasaki, HSetsuta, T Discovery of S-adenosyl-L-homocysteine hydrolase inhibitors based on non-adenosine analogs. Bioorg Med Chem Lett24:4336-40 (2014) 
 
Adenosylhomocysteinase
Name:Adenosylhomocysteinase
Type:PROTEIN
Mol. Mass.:47714.06
Organism:Homo sapiens (Human)
Description:ChEMBL_1507791
Residue:432
BDBM50050892
NameBDBM50050892
Synonyms:CHEMBL3322533
TypeSmall organic molecule
Emp. Form.C29H38Cl2N4O3
Mol. Mass.561.543
SMILESCN(C1CCCCC1)C(=O)CN(CC(=O)NCCN1CCCC1)c1cc(Cl)ccc1Oc1ccc(Cl)cc1