Reaction Details
TargetCarbonic anhydrase 2
LigandBDBM50050903
Substrate/Competitorn/a
Meas. Tech.ChEMBL_1460062 (CHEMBL3368596)
Ki 50±n/a nM
Citation Chegaev, KLazzarato, LTamboli, YBoschi, DBlangetti, MScozzafava, ACarta, FMasini, EFruttero, RSupuran, CTGasco, A Furazan and furoxan sulfonamides are stronga-carbonic anhydrase inhibitors and potential antiglaucoma agents. Bioorg Med Chem22:3913-21 (2014) 
 
Carbonic anhydrase 2
Name:Carbonic anhydrase 2
Type:Enzyme
Mol. Mass.:29250.71
Organism:Homo sapiens (Human)
Description:P00918
Residue:260
BDBM50050903
NameBDBM50050903
Synonyms:CHEMBL3309377
TypeSmall organic molecule
Emp. Form.C10H8N4O4S
Mol. Mass.280.26
SMILESNS(=O)(=O)c1ccc(OCc2nonc2C#N)cc1