Reaction Details
TargetCarbonic anhydrase 9
LigandBDBM50050901
Substrate/Competitorn/a
Meas. Tech.ChEMBL_1460063 (CHEMBL3368597)
Ki 50±n/a nM
Citation Chegaev, KLazzarato, LTamboli, YBoschi, DBlangetti, MScozzafava, ACarta, FMasini, EFruttero, RSupuran, CTGasco, A Furazan and furoxan sulfonamides are stronga-carbonic anhydrase inhibitors and potential antiglaucoma agents. Bioorg Med Chem22:3913-21 (2014) 
 
Carbonic anhydrase 9
Name:Carbonic anhydrase 9
Type:Enzyme
Mol. Mass.:49669.03
Organism:Homo sapiens (Human)
Description:Catalytic domain of human cloned isozyme was used in the assay
Residue:459
BDBM50050901
NameBDBM50050901
Synonyms:CHEMBL3309375
TypeSmall organic molecule
Emp. Form.C10H10N4O5S
Mol. Mass.298.275
SMILESNC(=O)c1nonc1COc1ccc(cc1)S(N)(=O)=O