Reaction Details
TargetCarbonic anhydrase 9
LigandBDBM50050906
Substrate/Competitorn/a
Meas. Tech.ChEMBL_1460063 (CHEMBL3368597)
Ki 6.4±n/a nM
Citation Chegaev, KLazzarato, LTamboli, YBoschi, DBlangetti, MScozzafava, ACarta, FMasini, EFruttero, RSupuran, CTGasco, A Furazan and furoxan sulfonamides are stronga-carbonic anhydrase inhibitors and potential antiglaucoma agents. Bioorg Med Chem22:3913-21 (2014) 
 
Carbonic anhydrase 9
Name:Carbonic anhydrase 9
Type:Enzyme
Mol. Mass.:49669.03
Organism:Homo sapiens (Human)
Description:Catalytic domain of human cloned isozyme was used in the assay
Residue:459
BDBM50050906
NameBDBM50050906
Synonyms:CHEMBL3309854
TypeSmall organic molecule
Emp. Form.C14H11N3O7S2
Mol. Mass.397.383
SMILESNS(=O)(=O)c1ccc(Oc2no[n+]([O-])c2S(=O)(=O)c2ccccc2)cc1