Reaction Details
TargetCarbonic anhydrase 12
LigandBDBM50324357
Substrate/Competitorn/a
Meas. Tech.ChEMBL_1460064 (CHEMBL3368598)
Ki 7.5±n/a nM
Citation Chegaev, KLazzarato, LTamboli, YBoschi, DBlangetti, MScozzafava, ACarta, FMasini, EFruttero, RSupuran, CTGasco, A Furazan and furoxan sulfonamides are stronga-carbonic anhydrase inhibitors and potential antiglaucoma agents. Bioorg Med Chem22:3913-21 (2014) 
 
Carbonic anhydrase 12
Name:Carbonic anhydrase 12
Type:Enzyme
Mol. Mass.:39456.00
Organism:Homo sapiens (Human)
Description:Catalytic domain of human cloned isozyme was used in the assay
Residue:354
BDBM50324357
NameBDBM50324357
Synonyms:4-phenyl-3-sulfamoyl-1,2,5-oxadiazole 2-oxide | CHEMBL1215509
TypeSmall organic molecule
Emp. Form.C8H7N3O4S
Mol. Mass.241.224
SMILESNS(=O)(=O)c1c(no[n+]1[O-])-c1ccccc1