Reaction Details
TargetCarbonic anhydrase 9
LigandBDBM50050921
Substrate/Competitorn/a
Meas. Tech.ChEMBL_1460063 (CHEMBL3368597)
Ki 5037±n/a nM
Citation Chegaev, KLazzarato, LTamboli, YBoschi, DBlangetti, MScozzafava, ACarta, FMasini, EFruttero, RSupuran, CTGasco, A Furazan and furoxan sulfonamides are stronga-carbonic anhydrase inhibitors and potential antiglaucoma agents. Bioorg Med Chem22:3913-21 (2014) 
 
Carbonic anhydrase 9
Name:Carbonic anhydrase 9
Type:Enzyme
Mol. Mass.:49669.03
Organism:Homo sapiens (Human)
Description:Catalytic domain of human cloned isozyme was used in the assay
Residue:459
BDBM50050921
NameBDBM50050921
Synonyms:CHEMBL3309370
TypeSmall organic molecule
Emp. Form.C14H11N3O4S2
Mol. Mass.349.385
SMILESNS(=O)(=O)c1ccc(cc1)-c1c(Sc2ccccc2)no[n+]1[O-]