Reaction Details
TargetCarbonic anhydrase 1
LigandBDBM50051029
Substrate/Competitorn/a
Meas. Tech.ChEMBL_1460061 (CHEMBL3368595)
Ki 20±n/a nM
Citation Chegaev, KLazzarato, LTamboli, YBoschi, DBlangetti, MScozzafava, ACarta, FMasini, EFruttero, RSupuran, CTGasco, A Furazan and furoxan sulfonamides are stronga-carbonic anhydrase inhibitors and potential antiglaucoma agents. Bioorg Med Chem22:3913-21 (2014) 
 
Carbonic anhydrase 1
Name:Carbonic anhydrase 1
Type:Enzyme
Mol. Mass.:28873.37
Organism:Homo sapiens (Human)
Description:P00915
Residue:261
BDBM50051029
NameBDBM50051029
Synonyms:CHEMBL3309360
TypeSmall organic molecule
Emp. Form.C9H9N3O4S
Mol. Mass.255.25
SMILESNS(=O)(=O)c1nonc1OCc1ccccc1