Reaction Details
TargetCarbonic anhydrase 1
LigandBDBM50050903
Substrate/Competitorn/a
Meas. Tech.ChEMBL_1460061 (CHEMBL3368595)
Ki 101±n/a nM
Citation Chegaev, KLazzarato, LTamboli, YBoschi, DBlangetti, MScozzafava, ACarta, FMasini, EFruttero, RSupuran, CTGasco, A Furazan and furoxan sulfonamides are stronga-carbonic anhydrase inhibitors and potential antiglaucoma agents. Bioorg Med Chem22:3913-21 (2014) 
 
Carbonic anhydrase 1
Name:Carbonic anhydrase 1
Type:Enzyme
Mol. Mass.:28873.37
Organism:Homo sapiens (Human)
Description:P00915
Residue:261
BDBM50050903
NameBDBM50050903
Synonyms:CHEMBL3309377
TypeSmall organic molecule
Emp. Form.C10H8N4O4S
Mol. Mass.280.26
SMILESNS(=O)(=O)c1ccc(OCc2nonc2C#N)cc1