Reaction Details
TargetCarbonic anhydrase 2
LigandBDBM50050921
Substrate/Competitorn/a
Meas. Tech.ChEMBL_1460062 (CHEMBL3368596)
Ki 113±n/a nM
Citation Chegaev, KLazzarato, LTamboli, YBoschi, DBlangetti, MScozzafava, ACarta, FMasini, EFruttero, RSupuran, CTGasco, A Furazan and furoxan sulfonamides are stronga-carbonic anhydrase inhibitors and potential antiglaucoma agents. Bioorg Med Chem22:3913-21 (2014) 
 
Carbonic anhydrase 2
Name:Carbonic anhydrase 2
Type:Enzyme
Mol. Mass.:29250.71
Organism:Homo sapiens (Human)
Description:P00918
Residue:260
BDBM50050921
NameBDBM50050921
Synonyms:CHEMBL3309370
TypeSmall organic molecule
Emp. Form.C14H11N3O4S2
Mol. Mass.349.385
SMILESNS(=O)(=O)c1ccc(cc1)-c1c(Sc2ccccc2)no[n+]1[O-]