Reaction Details
TargetAndrogen receptor
LigandBDBM50051054
Substrate/Competitorn/a
Meas. Tech.ChEMBL_1460097 (CHEMBL3368857)
IC50 5480±n/a nM
Citation Ban, FLeblanc, ELi, HMunuganti, RSFrewin, KRennie, PSCherkasov, A Discovery of 1H-indole-2-carboxamides as novel inhibitors of the androgen receptor binding function 3 (BF3). J Med Chem57:6867-72 (2014) 
 
Androgen receptor
Name:Androgen receptor
Type:Receptor
Mol. Mass.:99185.27
Organism:Homo sapiens (Human)
Description:CHO cells were stably transfected with human AR gene.
Residue:920
BDBM50051054
NameBDBM50051054
Synonyms:CHEMBL3317457
TypeSmall organic molecule
Emp. Form.C19H15FN2O3
Mol. Mass.338.3324
SMILESFc1ccc2cc([nH]c2c1)C(=O)N(Cc1ccco1)Cc1ccco1