Reaction Details
TargetAndrogen receptor
LigandBDBM50051060
Substrate/Competitorn/a
Meas. Tech.ChEMBL_1460096 (CHEMBL3368856)
IC50 430±n/a nM
Citation Ban, FLeblanc, ELi, HMunuganti, RSFrewin, KRennie, PSCherkasov, A Discovery of 1H-indole-2-carboxamides as novel inhibitors of the androgen receptor binding function 3 (BF3). J Med Chem57:6867-72 (2014) 
 
Androgen receptor
Name:Androgen receptor
Type:Receptor
Mol. Mass.:99185.27
Organism:Homo sapiens (Human)
Description:CHO cells were stably transfected with human AR gene.
Residue:920
BDBM50051060
NameBDBM50051060
Synonyms:CHEMBL3318070
TypeSmall organic molecule
Emp. Form.C17H17FN2O2
Mol. Mass.300.3275
SMILESCC(C)N(Cc1ccco1)C(=O)c1cc2ccc(F)cc2[nH]1