Reaction Details
TargetCarbonic anhydrase 9
LigandBDBM50051104
Substrate/Competitorn/a
Meas. Tech.ChEMBL_1448692 (CHEMBL3372050)
Ki 265±n/a nM
Citation D'Ascenzio, MCarradori, SSecci, DVullo, DCeruso, MAkdemir, ASupuran, CT Selective inhibition of human carbonic anhydrases by novel amide derivatives of probenecid: synthesis, biological evaluation and molecular modelling studies. Bioorg Med Chem22:3982-8 (2014) 
 
Carbonic anhydrase 9
Name:Carbonic anhydrase 9
Type:Enzyme
Mol. Mass.:49669.03
Organism:Homo sapiens (Human)
Description:Catalytic domain of human cloned isozyme was used in the assay
Residue:459
BDBM50051104
NameBDBM50051104
Synonyms:CHEMBL3311026
TypeSmall organic molecule
Emp. Form.C19H23N3O5S
Mol. Mass.405.468
SMILESCCCN(CCC)S(=O)(=O)c1ccc(cc1)C(=O)Nc1cccc(c1)[N+]([O-])=O