Reaction Details
TargetCarbonic anhydrase 1
LigandBDBM50051109
Substrate/Competitorn/a
Meas. Tech.ChEMBL_1448690 (CHEMBL3372048)
Ki 324±n/a nM
Citation D'Ascenzio, MCarradori, SSecci, DVullo, DCeruso, MAkdemir, ASupuran, CT Selective inhibition of human carbonic anhydrases by novel amide derivatives of probenecid: synthesis, biological evaluation and molecular modelling studies. Bioorg Med Chem22:3982-8 (2014) 
 
Carbonic anhydrase 1
Name:Carbonic anhydrase 1
Type:Enzyme
Mol. Mass.:28873.37
Organism:Homo sapiens (Human)
Description:P00915
Residue:261
BDBM50051109
NameBDBM50051109
Synonyms:CHEMBL3310915
TypeSmall organic molecule
Emp. Form.C19H24N2O3S
Mol. Mass.360.47
SMILESCCCN(CCC)S(=O)(=O)c1ccc(cc1)C(=O)Nc1ccccc1