Reaction Details
TargetCarbonic anhydrase 12
LigandBDBM50051110
Substrate/Competitorn/a
Meas. Tech.ChEMBL_1448693 (CHEMBL3372051)
Ki 15±n/a nM
Citation D'Ascenzio, MCarradori, SSecci, DVullo, DCeruso, MAkdemir, ASupuran, CT Selective inhibition of human carbonic anhydrases by novel amide derivatives of probenecid: synthesis, biological evaluation and molecular modelling studies. Bioorg Med Chem22:3982-8 (2014) 
 
Carbonic anhydrase 12
Name:Carbonic anhydrase 12
Type:Enzyme
Mol. Mass.:39456.00
Organism:Homo sapiens (Human)
Description:Catalytic domain of human cloned isozyme was used in the assay
Residue:354
BDBM50051110
NameBDBM50051110
Synonyms:CHEMBL3310914
TypeSmall organic molecule
Emp. Form.C19H31N3O4S
Mol. Mass.397.532
SMILESCCCN(CCC)S(=O)(=O)c1ccc(cc1)C(=O)NCCN1CCOCC1