Reaction Details
TargetFatty-acid amide hydrolase 1 [30-579]
LigandBDBM50052771
Substrate/Competitorn/a
Meas. Tech.ChEMBL_1456648 (CHEMBL3370248)
Ki 0.190000±n/a nM
Citation Otrubova, KSrinivasan, VBoger, DL Discovery libraries targeting the major enzyme classes: the serine hydrolases. Bioorg Med Chem Lett24:3807-13 (2014) 
 
Fatty-acid amide hydrolase 1 [30-579]
Name:Fatty-acid amide hydrolase 1 [30-579]
Type:Single-pass membrane protein; homodimer
Mol. Mass.:60474.00
Organism:Rattus norvegicus (rat)
Description:P97612 (aa 30-579)
Residue:550
BDBM50052771
NameBDBM50052771
Synonyms:CHEMBL3318617
TypeSmall organic molecule
Emp. Form.C22H21N5O
Mol. Mass.371.435
SMILESO=C(N1CCN(Cc2ccc(cc2)-c2ccccc2)CC1)n1cc(cn1)C#N