Reaction Details
TargetFatty-acid amide hydrolase 1 [30-579]
LigandBDBM50052784
Substrate/Competitorn/a
Meas. Tech.ChEMBL_1456649 (CHEMBL3370249)
Ki 0.470000±n/a nM
Citation Otrubova, KSrinivasan, VBoger, DL Discovery libraries targeting the major enzyme classes: the serine hydrolases. Bioorg Med Chem Lett24:3807-13 (2014) 
 
Fatty-acid amide hydrolase 1 [30-579]
Name:Fatty-acid amide hydrolase 1 [30-579]
Type:Single-pass membrane protein; homodimer
Mol. Mass.:60474.00
Organism:Rattus norvegicus (rat)
Description:P97612 (aa 30-579)
Residue:550
BDBM50052784
NameBDBM50052784
Synonyms:CHEMBL3318606
TypeSmall organic molecule
Emp. Form.C19H19BrN4O
Mol. Mass.399.284
SMILESBrc1cnn(c1)C(=O)N1CCN(Cc2ccc3ccccc3c2)CC1